Target
Histone acetyltransferase KAT6A [507-778]
Ligand
BDBM50527385
Substrate
Meas. Tech.
Biochemical Assay
IC50
126±n/a nM
Citation
 Voss, AKBaell, JNguyen, HNLeaver, DJCleary, BLLagiakos, HRSheikh, BNThomas, TJ Aryl sulfonohydrazides US Patent  US10829446 Publication Date 11/10/2020 
Target
Name:
Histone acetyltransferase KAT6A [507-778]
Synonyms:
2.3.1.48 KAT6A MOZ MYST-3 Monocytic leukemia zinc finger protein Runt-related transcription factor-binding protein 2 Zinc finger protein 220
Type:
PROTEIN
Mol. Mass.:
224994.11
Organism:
Homo sapiens
Description:
Q92794[507-778]
Residue:
2004
  
Inhibitor
Name:
BDBM50527385
Synonyms:
CHEMBL4465155 | US10829446, Compound 57
Type:
Small organic molecule
Emp. Form.:
C17H13FN4O3S
Mol. Mass.:
372.374
SMILES:
Fc1ccccc1S(=O)(=O)NNC(=O)c1cccc(c1)-c1ncccn1
: