Target
Histone acetyltransferase KAT6A [507-778]
Ligand
BDBM50527294
Substrate
Meas. Tech.
Biochemical Assay
IC50
440±n/a nM
Citation
 Voss, AKBaell, JNguyen, HNLeaver, DJCleary, BLLagiakos, HRSheikh, BNThomas, TJ Aryl sulfonohydrazides US Patent  US10829446 Publication Date 11/10/2020 
Target
Name:
Histone acetyltransferase KAT6A [507-778]
Synonyms:
2.3.1.48 KAT6A MOZ MYST-3 Monocytic leukemia zinc finger protein Runt-related transcription factor-binding protein 2 Zinc finger protein 220
Type:
PROTEIN
Mol. Mass.:
224994.11
Organism:
Homo sapiens
Description:
Q92794[507-778]
Residue:
2004
  
Inhibitor
Name:
BDBM50527294
Synonyms:
CHEMBL4451724 | US10829446, Compound 72
Type:
Small organic molecule
Emp. Form.:
C17H15FN4O3S
Mol. Mass.:
374.389
SMILES:
Cc1ccn(n1)-c1cc(F)cc(c1)C(=O)NNS(=O)(=O)c1ccccc1
: