Target
Nuclear receptor ROR-gamma
Ligand
BDBM416414
Substrate
Meas. Tech.
Radio-Ligand Binding Assay
Ki
<100±n/a nM
Citation
 Claremon, DADillard, LWFan, YLotesta, SDSingh, SBTice, CMZhao, WZhuang, L Substituted benzoimidazoles as modulators of ROR-γ US Patent  US10829448 Publication Date 11/10/2020 
Target
Name:
Nuclear receptor ROR-gamma
Synonyms:
NR1F3 Nuclear receptor ROR-gamma (RORC) RAR-related orphan receptor C (RORc) RORG RZRG Retinoid-related orphan receptor-gamma (RORc)
Type:
Enzyme Catalytic Domain
Mol. Mass.:
58218.40
Organism:
Homo sapiens (Human)
Description:
P51449
Residue:
518
  
Inhibitor
Name:
BDBM416414
Synonyms:
1-ethyl-N-(4-(ethylsulfonyl)benzyl)-2-(4-(trifluoromethyl)benzyl)-1H-indole-5-carboxamide US10829448, Compound IN-1
Type:
Small organic molecule
Emp. Form.:
C28H27F3N2O3S
Mol. Mass.:
528.586
SMILES:
CCn1c(Cc2ccc(cc2)C(F)(F)F)cc2cc(ccc12)C(=O)NCc1ccc(cc1)S(=O)(=O)CC
: