Target
Nuclear receptor ROR-gamma
Ligand
BDBM416455
Substrate
Meas. Tech.
Radio-Ligand Binding Assay
Ki
550±n/a nM
Citation
 Claremon, DADillard, LWFan, YLotesta, SDSingh, SBTice, CMZhao, WZhuang, L Substituted benzoimidazoles as modulators of ROR-γ US Patent  US10829448 Publication Date 11/10/2020 
Target
Name:
Nuclear receptor ROR-gamma
Synonyms:
NR1F3 Nuclear receptor ROR-gamma (RORC) RAR-related orphan receptor C (RORc) RORG RZRG Retinoid-related orphan receptor-gamma (RORc)
Type:
Enzyme Catalytic Domain
Mol. Mass.:
58218.40
Organism:
Homo sapiens (Human)
Description:
P51449
Residue:
518
  
Inhibitor
Name:
BDBM416455
Synonyms:
(R)-N-(2-(dimethylamino)-1-(4-(ethylsulfonyl)phenyl)ethyl)-1-ethyl-2-(4-(trifluoromethyl)phenoxy)-1H-benzo[d]imidazole-5-carboxamide US10829448, Compound BE-10
Type:
Small organic molecule
Emp. Form.:
C29H31F3N4O4S
Mol. Mass.:
588.641
SMILES:
CCn1c(Oc2ccc(cc2)C(F)(F)F)nc2cc(ccc12)C(=O)N[C@@H](CN(C)C)c1ccc(cc1)S(=O)(=O)CC
: