Target
Nuclear receptor ROR-gamma
Ligand
BDBM471802
Substrate
Meas. Tech.
Radio-Ligand Binding Assay
Ki
<100±n/a nM
Citation
 Claremon, DADillard, LWFan, YLotesta, SDSingh, SBTice, CMZhao, WZhuang, L Substituted benzoimidazoles as modulators of ROR-γ US Patent  US10829448 Publication Date 11/10/2020 
Target
Name:
Nuclear receptor ROR-gamma
Synonyms:
NR1F3 Nuclear receptor ROR-gamma (RORC) RAR-related orphan receptor C (RORc) RORG RZRG Retinoid-related orphan receptor-gamma (RORc)
Type:
Enzyme Catalytic Domain
Mol. Mass.:
58218.40
Organism:
Homo sapiens (Human)
Description:
P51449
Residue:
518
  
Inhibitor
Name:
BDBM471802
Synonyms:
N-(4-(ethylsulfonyl)benzyl)-1-isobutyl-2-(((1r,4r)-4-(trifluoromethyl)cyclohexyl)methyl)-1H- benzo[d]imidazole-5-carboxamide US10829448, Compound BE-19.2
Type:
Small organic molecule
Emp. Form.:
C29H36F3N3O3S
Mol. Mass.:
563.675
SMILES:
CCS(=O)(=O)c1ccc(CNC(=O)c2ccc3n(CC(C)C)c(CC4CCC(CC4)C(F)(F)F)nc3c2)cc1
: