Target
Nuclear receptor ROR-gamma
Ligand
BDBM471825
Substrate
Meas. Tech.
Radio-Ligand Binding Assay
Ki
<100±n/a nM
Citation
 Claremon, DADillard, LWFan, YLotesta, SDSingh, SBTice, CMZhao, WZhuang, L Substituted benzoimidazoles as modulators of ROR-γ US Patent  US10829448 Publication Date 11/10/2020 
Target
Name:
Nuclear receptor ROR-gamma
Synonyms:
NR1F3 Nuclear receptor ROR-gamma (RORC) RAR-related orphan receptor C (RORc) RORG RZRG Retinoid-related orphan receptor-gamma (RORc)
Type:
Enzyme Catalytic Domain
Mol. Mass.:
58218.40
Organism:
Homo sapiens (Human)
Description:
P51449
Residue:
518
  
Inhibitor
Name:
BDBM471825
Synonyms:
1-cyclopropyl-N-((R)-2-hydroxy-1-(4- (methylsulfonyl)phenyl)ethyl)-2-(((1r,4R)-4- (trifluoromethyl)cyclohexyl)methyl)-1H- benzo[d]imidazole-5-carboxamide | US10829448, Compound BE-32
Type:
Small organic molecule
Emp. Form.:
C28H32F3N3O4S
Mol. Mass.:
563.632
SMILES:
CS(=O)(=O)c1ccc(cc1)[C@H](CO)NC(=O)c1ccc2n(C3CC3)c(CC3CCC(CC3)C(F)(F)F)nc2c1
: