Target
Nuclear receptor ROR-gamma
Ligand
BDBM471864
Substrate
Meas. Tech.
Radio-Ligand Binding Assay
Ki
550±n/a nM
Citation
 Claremon, DADillard, LWFan, YLotesta, SDSingh, SBTice, CMZhao, WZhuang, L Substituted benzoimidazoles as modulators of ROR-γ US Patent  US10829448 Publication Date 11/10/2020 
Target
Name:
Nuclear receptor ROR-gamma
Synonyms:
NR1F3 Nuclear receptor ROR-gamma (RORC) RAR-related orphan receptor C (RORc) RORG RZRG Retinoid-related orphan receptor-gamma (RORc)
Type:
Enzyme Catalytic Domain
Mol. Mass.:
58218.40
Organism:
Homo sapiens (Human)
Description:
P51449
Residue:
518
  
Inhibitor
Name:
BDBM471864
Synonyms:
US10829448, Compound BE-57.4
Type:
Small organic molecule
Emp. Form.:
C26H30F3N3O5S
Mol. Mass.:
553.594
SMILES:
CCS(=O)(=O)c1ccc(cc1)[C@H](CO)NC(=O)c1ccc2n(C)c(C[C@H]3CC[C@H](OC3)C(F)(F)F)nc2c1
: