Target
Nuclear receptor ROR-gamma
Ligand
BDBM471884
Substrate
Meas. Tech.
Radio-Ligand Binding Assay
Ki
<100±n/a nM
Citation
 Claremon, DADillard, LWFan, YLotesta, SDSingh, SBTice, CMZhao, WZhuang, L Substituted benzoimidazoles as modulators of ROR-γ US Patent  US10829448 Publication Date 11/10/2020 
Target
Name:
Nuclear receptor ROR-gamma
Synonyms:
NR1F3 Nuclear receptor ROR-gamma (RORC) RAR-related orphan receptor C (RORc) RORG RZRG Retinoid-related orphan receptor-gamma (RORc)
Type:
Enzyme Catalytic Domain
Mol. Mass.:
58218.40
Organism:
Homo sapiens (Human)
Description:
P51449
Residue:
518
  
Inhibitor
Name:
BDBM471884
Synonyms:
1-cyclopropyl-N-((R)-1-(4-(ethylsulfonyl)phenyl)-2-hydroxyethyl)-2-((((1s,4S)-4- (trifluoromethyl)cyclohexyl)oxy)methyl)-1H- benzo[d]imidazole-5-carboxamide | US10829448, Compound BE-71.1
Type:
Small organic molecule
Emp. Form.:
C29H34F3N3O5S
Mol. Mass.:
593.658
SMILES:
CCS(=O)(=O)c1ccc(cc1)[C@H](CO)NC(=O)c1ccc2n(C3CC3)c(CO[C@H]3CC[C@@H](CC3)C(F)(F)F)nc2c1
: