Target
Nuclear receptor ROR-gamma
Ligand
BDBM416533
Substrate
Meas. Tech.
Radio-Ligand Binding Assay
Ki
550±n/a nM
Citation
 Claremon, DADillard, LWFan, YLotesta, SDSingh, SBTice, CMZhao, WZhuang, L Substituted benzoimidazoles as modulators of ROR-γ US Patent  US10829448 Publication Date 11/10/2020 
Target
Name:
Nuclear receptor ROR-gamma
Synonyms:
NR1F3 Nuclear receptor ROR-gamma (RORC) RAR-related orphan receptor C (RORc) RORG RZRG Retinoid-related orphan receptor-gamma (RORc)
Type:
Enzyme Catalytic Domain
Mol. Mass.:
58218.40
Organism:
Homo sapiens (Human)
Description:
P51449
Residue:
518
  
Inhibitor
Name:
BDBM416533
Synonyms:
3-cyclopropyl-N-(4-(methylsulfonyl)benzyl)-2-(4-(trifluoromethyl)benzyl)-3H-imidazo[4,5-b]pyridine-6-carboxamide US10829448, Compound AB-2
Type:
Small organic molecule
Emp. Form.:
C26H23F3N4O3S
Mol. Mass.:
528.546
SMILES:
CS(=O)(=O)c1ccc(CNC(=O)c2cnc3n(C4CC4)c(Cc4ccc(cc4)C(F)(F)F)nc3c2)cc1
: