Target
A disintegrin and metalloproteinase with thrombospondin motifs 6
Ligand
BDBM471792
Substrate
Meas. Tech.
In Vitro Assay
IC50
12.5±n/a nM
Citation
 Labéguère, FGHeng, RDe Ceuninck, FAAlvey, LJAmantini, DBrebion, FLDeprez, PMGosmini, RLJary, HMPeixoto, CPop-Botez, IEVarin, ML 5-[3-[piperazin-1-yl]-3-oxo-propyl]-imidazolidine-2,4-dione derivatives as ADAMTS 4 and 5 inhibitors for treating e.g. osteoarthritis US Patent  US10829478 Publication Date 11/10/2020 
Target
Name:
A disintegrin and metalloproteinase with thrombospondin motifs 6
Synonyms:
ADAM-TS 6 ADAMTS-6 ATS6_HUMAN
Type:
Protein
Mol. Mass.:
125276.26
Organism:
Human
Description:
Q9UKP5
Residue:
1117
  
Inhibitor
Name:
BDBM471792
Synonyms:
5-[3-[4-(4-chloro- 3-methoxy- phenyl)-3-methyl- piperazin-1-yl]-2- methyl-3-oxo- propyl]-5-methyl- imidazolidine- 2,4-dione | US10829478, Compound 41
Type:
Small organic molecule
Emp. Form.:
C20H27ClN4O4
Mol. Mass.:
422.906
SMILES:
COc1cc(ccc1Cl)N1CCN(C[C@@H]1C)C(=O)[C@@H](C)C[C@@]1(C)NC(=O)NC1=O
: