Target
A disintegrin and metalloproteinase with thrombospondin motifs 6
Ligand
BDBM471975
Substrate
Meas. Tech.
In Vitro Assay
IC50
12.5±n/a nM
Citation
 Labéguère, FGHeng, RDe Ceuninck, FAAlvey, LJAmantini, DBrebion, FLDeprez, PMGosmini, RLJary, HMPeixoto, CPop-Botez, IEVarin, ML 5-[3-[piperazin-1-yl]-3-oxo-propyl]-imidazolidine-2,4-dione derivatives as ADAMTS 4 and 5 inhibitors for treating e.g. osteoarthritis US Patent  US10829478 Publication Date 11/10/2020 
Target
Name:
A disintegrin and metalloproteinase with thrombospondin motifs 6
Synonyms:
ADAM-TS 6 ADAMTS-6 ATS6_HUMAN
Type:
Protein
Mol. Mass.:
125276.26
Organism:
Human
Description:
Q9UKP5
Residue:
1117
  
Inhibitor
Name:
BDBM471975
Synonyms:
5-[3-[(3S)-4-[4- chloro-3- (trifluoro- methoxy) phenyl]- 3-methyl- piperazin- 1-yl]-3- oxo-propyl]- 5-(6-methyl-2- pyridyl) imidazolidine- 2,4-dione | US10829478, Compound 101
Type:
Small organic molecule
Emp. Form.:
C24H25ClF3N5O4
Mol. Mass.:
539.935
SMILES:
C[C@H]1CN(CCN1c1ccc(Cl)c(OC(F)(F)F)c1)C(=O)CCC1(NC(=O)NC1=O)c1cccc(C)n1
: