Target
Mu-type opioid receptor
Ligand
BDBM472085
Substrate
Meas. Tech.
Receptor Binding Assay
Ki
3.50±n/a nM
Citation
 Kuehnert, SKoenigs, RMKless, AWegert, ARatcliffe, PJostock, RKoch, TLinz, KSchroeder, WSchiene, KKonetzki, I 3-((hetero-)aryl)-alkyl-8-amino-2-oxo-l,3-diaza-spiro-[4.5]-decane derivatives US Patent  US10829480 Publication Date 11/10/2020 
Target
Name:
Mu-type opioid receptor
Synonyms:
M-OR-1 MOR-1 MUOR1 Mu opiate receptor OPRM1 hMOP | mu-type opioid receptor isoform MOR-1
Type:
G Protein-Coupled Receptor (GPCR)
Mol. Mass.:
44789.51
Organism:
Homo sapiens (Human)
Description:
P35372
Residue:
400
  
Inhibitor
Name:
BDBM472085
Synonyms:
CIS-1-(Cyclobutyl-methyl)-8-dimethylamino-8-phenyl-3-[[6-(trifluoromethyl)- pyridin-3-yl]-methyl]-1,3-diazaspiro[4.5]decan-2-one | US10829480, Example SC_2086
Type:
Small organic molecule
Emp. Form.:
C28H35F3N4O
Mol. Mass.:
500.5989
SMILES:
CN(C)[C@]1(CC[C@]2(CN(Cc3ccc(nc3)C(F)(F)F)C(=O)N2CC2CCC2)CC1)c1ccccc1
: