Target
Mu-type opioid receptor
Ligand
BDBM472098
Substrate
Meas. Tech.
Receptor Binding Assay
Ki
0.800±n/a nM
Citation
 Kuehnert, SKoenigs, RMKless, AWegert, ARatcliffe, PJostock, RKoch, TLinz, KSchroeder, WSchiene, KKonetzki, I 3-((hetero-)aryl)-alkyl-8-amino-2-oxo-l,3-diaza-spiro-[4.5]-decane derivatives US Patent  US10829480 Publication Date 11/10/2020 
Target
Name:
Mu-type opioid receptor
Synonyms:
M-OR-1 MOR-1 MUOR1 Mu opiate receptor OPRM1 hMOP | mu-type opioid receptor isoform MOR-1
Type:
G Protein-Coupled Receptor (GPCR)
Mol. Mass.:
44789.51
Organism:
Homo sapiens (Human)
Description:
P35372
Residue:
400
  
Inhibitor
Name:
BDBM472098
Synonyms:
CIS-1-(Cyclobutyl-methyl)-8-dimethylamino-3-[(3-methylsulfonyl-phenyl)-methyl]- 8-phenyl-1,3-diazaspiro[4.5]decan-2-one | US10829480, Example SC_2093
Type:
Small organic molecule
Emp. Form.:
C29H39N3O3S
Mol. Mass.:
509.703
SMILES:
CN(C)[C@]1(CC[C@]2(CN(Cc3cccc(c3)S(C)(=O)=O)C(=O)N2CC2CCC2)CC1)c1ccccc1
: