Target
Nuclear receptor ROR-gamma
Ligand
BDBM472159
Substrate
Meas. Tech.
Binding Assay
Ki
<100±n/a nM
Citation
 Claremon, DADillard, LWFan, YLotesta, SDSingh, SBTice, CMZhao, WZhuang, L Benzimidazole derivatives as modulators of ROR-gamma US Patent  US10829481 Publication Date 11/10/2020 
Target
Name:
Nuclear receptor ROR-gamma
Synonyms:
NR1F3 Nuclear receptor ROR-gamma (RORC) RAR-related orphan receptor C (RORc) RORG RZRG Retinoid-related orphan receptor-gamma (RORc)
Type:
Enzyme Catalytic Domain
Mol. Mass.:
58218.40
Organism:
Homo sapiens (Human)
Description:
P51449
Residue:
518
  
Inhibitor
Name:
BDBM472159
Synonyms:
N-(2-cyclopropyl-1-((2,2-difluorobenzo[d][1,3]dioxol-4-yl)methyl)- | US10829481, Compound I-9
Type:
Small organic molecule
Emp. Form.:
C28H25F2N3O5S
Mol. Mass.:
553.577
SMILES:
CCS(=O)(=O)c1ccc(CC(=O)Nc2ccc3n(Cc4cccc5OC(F)(F)Oc45)c(nc3c2)C2CC2)cc1
: