Target
Nuclear receptor ROR-gamma
Ligand
BDBM472260
Substrate
Meas. Tech.
Binding Assay
Ki
<100±n/a nM
Citation
 Claremon, DADillard, LWFan, YLotesta, SDSingh, SBTice, CMZhao, WZhuang, L Benzimidazole derivatives as modulators of ROR-gamma US Patent  US10829481 Publication Date 11/10/2020 
Target
Name:
Nuclear receptor ROR-gamma
Synonyms:
NR1F3 Nuclear receptor ROR-gamma (RORC) RAR-related orphan receptor C (RORc) RORG RZRG Retinoid-related orphan receptor-gamma (RORc)
Type:
Enzyme Catalytic Domain
Mol. Mass.:
58218.40
Organism:
Homo sapiens (Human)
Description:
P51449
Residue:
518
  
Inhibitor
Name:
BDBM472260
Synonyms:
1-(3,5-dimethoxybenzyl)-N-(4-(ethylsulfonyl)benzyl)-2- | US10829481, Compound I-82
Type:
Small organic molecule
Emp. Form.:
C27H26F3N3O5S
Mol. Mass.:
561.573
SMILES:
CCS(=O)(=O)c1ccc(CNC(=O)c2ccc3n(Cc4cc(OC)cc(OC)c4)c(nc3c2)C(F)(F)F)cc1
: