Target
Nuclear receptor ROR-gamma
Ligand
BDBM472353
Substrate
Meas. Tech.
Binding Assay
Ki
<100±n/a nM
Citation
 Claremon, DADillard, LWFan, YLotesta, SDSingh, SBTice, CMZhao, WZhuang, L Benzimidazole derivatives as modulators of ROR-gamma US Patent  US10829481 Publication Date 11/10/2020 
Target
Name:
Nuclear receptor ROR-gamma
Synonyms:
NR1F3 Nuclear receptor ROR-gamma (RORC) RAR-related orphan receptor C (RORc) RORG RZRG Retinoid-related orphan receptor-gamma (RORc)
Type:
Enzyme Catalytic Domain
Mol. Mass.:
58218.40
Organism:
Homo sapiens (Human)
Description:
P51449
Residue:
518
  
Inhibitor
Name:
BDBM472353
Synonyms:
1-(benzo[c][1,2,5]oxadiazol-4-ylmethyl)-N-(4-(ethylsulfonyl)benzyl)-2- | US10829481, Compound I-151
Type:
Small organic molecule
Emp. Form.:
C25H20F3N5O4S
Mol. Mass.:
543.518
SMILES:
CCS(=O)(=O)c1ccc(CNC(=O)c2ccc3n(Cc4cccc5nonc45)c(nc3c2)C(F)(F)F)cc1
: