Target
Solute carrier family 22 member 12
Ligand
BDBM472450
Substrate
Meas. Tech.
In Vitro Inhibitory Activity Assay
IC50
>5000±n/a nM
Citation
 Wang, JZhang, YZhu, WChen, S Thiophene, manufacturing method thereof, and pharmaceutical application of same US Patent  US10829483 Publication Date 11/10/2020 
Target
Name:
Solute carrier family 22 member 12
Synonyms:
OATL4 RST S22AC_HUMAN Solute carrier family 22 member 12 URAT1 Urate anion exchanger 1 (URAT1) | Uric Acid Transporter 1 (URAT1)
Type:
Enzyme
Mol. Mass.:
59638.65
Organism:
Homo sapiens (Human)
Description:
Q96S37
Residue:
553
  
Inhibitor
Name:
BDBM472450
Synonyms:
US10829483, Compound WX047
Type:
Small organic molecule
Emp. Form.:
C15H14BrN5O2S2
Mol. Mass.:
440.338
SMILES:
Cn1cc(cn1)-c1sc(c2CCCc12)-n1c(Br)nnc1SCC(O)=O
: