Target
Solute carrier family 22 member 12
Ligand
BDBM472465
Substrate
Meas. Tech.
In Vitro Inhibitory Activity Assay
IC50
2750±n/a nM
Citation
 Wang, JZhang, YZhu, WChen, S Thiophene, manufacturing method thereof, and pharmaceutical application of same US Patent  US10829483 Publication Date 11/10/2020 
Target
Name:
Solute carrier family 22 member 12
Synonyms:
OATL4 RST S22AC_HUMAN Solute carrier family 22 member 12 URAT1 Urate anion exchanger 1 (URAT1) | Uric Acid Transporter 1 (URAT1)
Type:
Enzyme
Mol. Mass.:
59638.65
Organism:
Homo sapiens (Human)
Description:
Q96S37
Residue:
553
  
Inhibitor
Name:
BDBM472465
Synonyms:
US10829483, Compound WX057
Type:
Small organic molecule
Emp. Form.:
C19H19BrN4O2S2
Mol. Mass.:
479.414
SMILES:
CN(C)c1ccc(cc1Br)-c1sc(c2CCCc12)-n1cnnc1SCC(O)=O
: