Target
Solute carrier family 22 member 12
Ligand
BDBM472514
Substrate
Meas. Tech.
In Vitro Inhibitory Activity Assay
IC50
>5000±n/a nM
Citation
 Wang, JZhang, YZhu, WChen, S Thiophene, manufacturing method thereof, and pharmaceutical application of same US Patent  US10829483 Publication Date 11/10/2020 
Target
Name:
Solute carrier family 22 member 12
Synonyms:
OATL4 RST S22AC_HUMAN Solute carrier family 22 member 12 URAT1 Urate anion exchanger 1 (URAT1) | Uric Acid Transporter 1 (URAT1)
Type:
Enzyme
Mol. Mass.:
59638.65
Organism:
Homo sapiens (Human)
Description:
Q96S37
Residue:
553
  
Inhibitor
Name:
BDBM472514
Synonyms:
US10829483, Compound WX097
Type:
Small organic molecule
Emp. Form.:
C16H12F3N3O2S2
Mol. Mass.:
399.411
SMILES:
Cc1cc(sc1-c1ccc(cc1)C(F)(F)F)-n1cnnc1SCC(O)=O
: