Target
GTPase KRas [1-169,G12D]/Son of sevenless homolog 1 [564-1049]
Ligand
BDBM472569
Substrate
Meas. Tech.
TBDAlphaScreen Binding Assay
IC50
27.0±n/a nM
Citation
 Ramharter, JKofink, CStadtmueller, HWunberg, T Benzylamino substituted pyridopyrimidinones and derivatives as SOS1 inhibitors US Patent  US10829487 Publication Date 11/10/2020 
Target
Name:
GTPase KRas [1-169,G12D]/Son of sevenless homolog 1 [564-1049]
Synonyms:
SOS1 and KRAS G12D
Type:
Protein
Mol. Mass.:
Description:
Components:
This complex has 2 components.
Component 1
Name:
Son of sevenless homolog 1 [564-1049]
Synonyms:
SOS1 Son of sevenless homolog 1 (SOS1)(564-1049)
Type:
Enzyme Catalytic Domain
Mol. Mass.:
56970.22
Organism:
Description:
aa 564-1049
Residue:
486
 
Component 2
Name:
GTPase KRas [1-169,G12D]
Synonyms:
GTPase KRas (KRAS)(1-169)(G12D) KRAS RASK2 | RASK_HUMAN
Type:
Enzyme Catalytic Domain
Mol. Mass.:
19450.24
Organism:
Description:
aa 1-169
Residue:
169
 
Inhibitor
Name:
BDBM472569
Synonyms:
US10829487, Example I-48
Type:
Small organic molecule
Emp. Form.:
C23H22F6N4O2
Mol. Mass.:
500.4368
SMILES:
C[C@@H](Nc1nc(C)nc2cc(=O)n(cc12)[C@H]1C[C@](O)(C1)C(F)(F)F)c1cccc(c1C)C(F)(F)F
: