Target
GTPase KRas [1-169,G12D]/Son of sevenless homolog 1 [564-1049]
Ligand
BDBM472602
Substrate
Meas. Tech.
TBDAlphaScreen Binding Assay
IC50
9.00±n/a nM
Citation
 Ramharter, JKofink, CStadtmueller, HWunberg, T Benzylamino substituted pyridopyrimidinones and derivatives as SOS1 inhibitors US Patent  US10829487 Publication Date 11/10/2020 
Target
Name:
GTPase KRas [1-169,G12D]/Son of sevenless homolog 1 [564-1049]
Synonyms:
SOS1 and KRAS G12D
Type:
Protein
Mol. Mass.:
Description:
Components:
This complex has 2 components.
Component 1
Name:
Son of sevenless homolog 1 [564-1049]
Synonyms:
SOS1 Son of sevenless homolog 1 (SOS1)(564-1049)
Type:
Enzyme Catalytic Domain
Mol. Mass.:
56970.22
Organism:
Description:
aa 564-1049
Residue:
486
 
Component 2
Name:
GTPase KRas [1-169,G12D]
Synonyms:
GTPase KRas (KRAS)(1-169)(G12D) KRAS RASK2 | RASK_HUMAN
Type:
Enzyme Catalytic Domain
Mol. Mass.:
19450.24
Organism:
Description:
aa 1-169
Residue:
169
 
Inhibitor
Name:
BDBM472602
Synonyms:
US10829487, Example I-85
Type:
Small organic molecule
Emp. Form.:
C22H19F7N4O2
Mol. Mass.:
504.4007
SMILES:
C[C@@H](Nc1nc(C)nc2c(F)c(=O)n(cc12)[C@@]1(CCOC1)C(F)(F)F)c1cccc(C(F)F)c1F
: