Target
Bcl-2-like protein 11 [81-106]
Ligand
BDBM361580
Substrate
Meas. Tech.
Fluorescence Polarization Assay
IC50
20.6±n/a nM
Citation
 Wang, SChen, J N-(phenylsulfonyl)benzamides and related compounds as bcl-2 inhibitors US Patent  US10829488 Publication Date 11/10/2020 
Target
Name:
Bcl-2-like protein 11 [81-106]
Synonyms:
B2L11_HUMAN BIM | Bcl-2-like protein 11 (BIM)(81-106)
Type:
Enzyme Catalytic Domain
Mol. Mass.:
2973.28
Organism:
Homo sapiens (Human)
Description:
aa 81-106
Residue:
26
  
Inhibitor
Name:
BDBM361580
Synonyms:
2-((1H-pyrrolo[2,3-b]pyridin-5-yl)oxy)-4-(1-((6-(4- chlorophenyl)-2-oxaspiro[3.5]non-6-en-7- yl)methyl)-1,2,3,6-tetrahydropyridin-4-yl)-N-((3- nitro-4-(((tetrahydro-2H-pyran-4- yl)methyl)amino)phenyl)sulfonyl)benzamide US10829488, Compound 9
Type:
Small organic molecule
Emp. Form.:
C46H47ClN6O8S
Mol. Mass.:
879.419
SMILES:
[O-][N+](=O)c1cc(ccc1NCC1CCOCC1)S(=O)(=O)NC(=O)c1ccc(cc1Oc1cnc2[nH]ccc2c1)C1=CCN(CC2=C(CC3(COC3)CC2)c2ccc(Cl)cc2)CC1
: