Target
Bcl-2-like protein 11 [81-106]
Ligand
BDBM361582
Substrate
Meas. Tech.
Fluorescence Polarization Assay
IC50
77.8±n/a nM
Citation
 Wang, SChen, J N-(phenylsulfonyl)benzamides and related compounds as bcl-2 inhibitors US Patent  US10829488 Publication Date 11/10/2020 
Target
Name:
Bcl-2-like protein 11 [81-106]
Synonyms:
B2L11_HUMAN BIM | Bcl-2-like protein 11 (BIM)(81-106)
Type:
Enzyme Catalytic Domain
Mol. Mass.:
2973.28
Organism:
Homo sapiens (Human)
Description:
aa 81-106
Residue:
26
  
Inhibitor
Name:
BDBM361582
Synonyms:
2-((1H-pyrrolo[2,3-b]pyridin-5-yl)oxy)-4-(4-((6-(4- chlorophenyl)spiro[3.5]non-6-en-7- yl)methyl)piperazin-1-yl)-N-((4-(dimethylamino)-3- nitrophenyl)sulfonyl)benzamide US10829488, Compound 11 | US11718613, Compound 11
Type:
Small organic molecule
Emp. Form.:
C42H44ClN7O6S
Mol. Mass.:
810.36
SMILES:
CN(C)c1ccc(cc1[N+]([O-])=O)S(=O)(=O)NC(=O)c1ccc(cc1Oc1cnc2[nH]ccc2c1)N1CCN(CC2=C(CC3(CCC3)CC2)c2ccc(Cl)cc2)CC1
: