Target
Bcl-2-like protein 11 [72-87]
Ligand
BDBM361593
Substrate
Meas. Tech.
Fluorescence Polarization Assay
IC50
2.70±n/a nM
Citation
 Wang, SChen, J N-(phenylsulfonyl)benzamides and related compounds as bcl-2 inhibitors US Patent  US10829488 Publication Date 11/10/2020 
Target
Name:
Bcl-2-like protein 11 [72-87]
Synonyms:
B2L11_HUMAN BIM | Bcl-2 homologous antagonist/killer (BAK)(72-87)
Type:
Enzyme Catalytic Domain
Mol. Mass.:
1724.92
Organism:
Homo sapiens (Human)
Description:
aa 72-87
Residue:
16
GQVGRQLAIIGDDINR
  
Inhibitor
Name:
BDBM361593
Synonyms:
2-((1H-pyrrolo[2,3-b]pyridin-5-yl)oxy)-4-(4- ((6-(4-chlorophenyl)spiro[3.5]non-6-en-7 yl)methyl)piperazin-1-yl)-N-((7-nitro-2- (pyridin-4-yl)-1H-benzo[d]imidazol-5- yl)sulfonyl)benzamide US10829488, Compound 66
Type:
Small organic molecule
Emp. Form.:
C46H42ClN9O6S
Mol. Mass.:
884.4
SMILES:
[O-][N+](=O)c1cc(cc2nc([nH]c12)-c1ccncc1)S(=O)(=O)NC(=O)c1ccc(cc1Oc1cnc2[nH]ccc2c1)N1CCN(CC2=C(CC3(CCC3)CC2)c2ccc(Cl)cc2)CC1
: