Target
[Pyruvate dehydrogenase (acetyl-transferring)] kinase isozyme 2, mitochondrial
Ligand
BDBM426325
Substrate
Meas. Tech.
Isothermal Titration Calorimetry
Kd
1650±n/a nM
Citation
 Buchstaller, H Bicyclic heterocyclic derivatives US Patent  US10829489 Publication Date 11/10/2020 
Target
Name:
[Pyruvate dehydrogenase (acetyl-transferring)] kinase isozyme 2, mitochondrial
Synonyms:
PDHK2 PDK2_HUMAN Pyruvate dehydrogenase kinase isoenzyme 1 (PDK2)
Type:
Enzyme
Mol. Mass.:
46153.78
Organism:
Homo sapiens (Human)
Description:
Q15119
Residue:
407
  
Inhibitor
Name:
BDBM426325
Synonyms:
US10526325, Compound A2 US11261185, Example 2
Type:
Small organic molecule
Emp. Form.:
C16H15ClF3N3O2
Mol. Mass.:
373.757
SMILES:
C[C@@](O)(C(=O)N1CCc2nn(cc2C1)-c1ccc(Cl)cc1)C(F)(F)F
: