Target
[Pyruvate dehydrogenase (acetyl-transferring)] kinase isozyme 2, mitochondrial
Ligand
BDBM426328
Substrate
Meas. Tech.
Biochemical Activity Assay
IC50
<300±n/a nM
Citation
 Buchstaller, H Bicyclic heterocyclic derivatives US Patent  US10829489 Publication Date 11/10/2020 
Target
Name:
[Pyruvate dehydrogenase (acetyl-transferring)] kinase isozyme 2, mitochondrial
Synonyms:
PDHK2 PDK2_HUMAN Pyruvate dehydrogenase kinase isoenzyme 1 (PDK2)
Type:
Enzyme
Mol. Mass.:
46153.78
Organism:
Homo sapiens (Human)
Description:
Q15119
Residue:
407
  
Inhibitor
Name:
BDBM426328
Synonyms:
US10526325, Compound A5 US11261185, Example 5
Type:
Small organic molecule
Emp. Form.:
C16H14F5N3O2
Mol. Mass.:
375.2933
SMILES:
C[C@@](O)(C(=O)N1CCc2c(C1)cnn2-c1ccc(F)cc1F)C(F)(F)F
: