Target
[Pyruvate dehydrogenase (acetyl-transferring)] kinase isozyme 2, mitochondrial
Ligand
BDBM426334
Substrate
Meas. Tech.
Biochemical Activity Assay
IC50
26500±n/a nM
Citation
 Buchstaller, H Bicyclic heterocyclic derivatives US Patent  US10829489 Publication Date 11/10/2020 
Target
Name:
[Pyruvate dehydrogenase (acetyl-transferring)] kinase isozyme 2, mitochondrial
Synonyms:
PDHK2 PDK2_HUMAN Pyruvate dehydrogenase kinase isoenzyme 1 (PDK2)
Type:
Enzyme
Mol. Mass.:
46153.78
Organism:
Homo sapiens (Human)
Description:
Q15119
Residue:
407
  
Inhibitor
Name:
BDBM426334
Synonyms:
US10526325, Compound A11 US11261185, Example 11
Type:
Small organic molecule
Emp. Form.:
C17H17ClF3N3O2
Mol. Mass.:
387.784
SMILES:
C[C@H]1CN(Cc2cnn(c12)-c1ccc(Cl)cc1)C(=O)[C@@](C)(O)C(F)(F)F
: