Target
Cyclin-A2/Cyclin-dependent kinase 2
Ligand
BDBM472677
Substrate
Meas. Tech.
Inhibition In Vitro Assay
IC50
86400±n/a nM
Citation
 Strum, JCJung, D Substituted dihydropyrazino[1 ′,2′:1,5]pyrrolo[2,3-d]pyrimidine-based antiproliferative agents US Patent  US10829490 Publication Date 11/10/2020 
Target
Name:
Cyclin-A2/Cyclin-dependent kinase 2
Synonyms:
CDK2-CyclinA CDK2/Cyclin A Cyclin A2/dependent kinase 2 Cyclin-Dependent Kinase 2 (CDK2A)
Type:
Protein Complex
Mol. Mass.:
Description:
Cdk2/Cyclin A kinase was purified from insect cells coinfected with Cyclin A/Cdk2 baculovirus.
Components:
This complex has 2 components.
Component 1
Name:
Cyclin-dependent kinase 2
Synonyms:
CDK2 CDK2_HUMAN Cell division protein kinase 2 Protein cereblon/Cyclin-dependent kinase 2 | p33 protein kinase
Type:
Enzyme Subunit
Mol. Mass.:
33938.17
Organism:
Homo sapiens (Human)
Description:
P24941
Residue:
298
  
Component 2
Name:
Cyclin-A2
Synonyms:
CCN1 CCNA1 CCNA2_HUMAN Cyclin-A
Type:
Enzyme Subunit
Mol. Mass.:
48550.19
Organism:
Homo sapiens (Human)
Description:
P20248
Residue:
432
  
Inhibitor
Name:
BDBM472677
Synonyms:
2'-((5-(4-methylpiperazin-1- yl)pyridin-2-yl)amino)-6',6a',8',9'- tetrahydrospiro[cyclohexane-1,10'- pyrazino[1',2':1,6]pyrido[2,3- d]pyrimidin]-7'(5'H)-one | US10829490, Cmpd # 4
Type:
Small organic molecule
Emp. Form.:
C25H34N8O
Mol. Mass.:
462.5905
SMILES:
CN1CCN(CC1)c1ccc(Nc2ncc3CCC4N(c3n2)C2(CCCCC2)CNC4=O)nc1
: