Target
Cyclin-dependent kinase 5 activator 1 [99-307]
Ligand
BDBM472683
Substrate
Meas. Tech.
Inhibition In Vitro Assay
IC50
>100000±n/a nM
Citation
 Strum, JCJung, D Substituted dihydropyrazino[1 ′,2′:1,5]pyrrolo[2,3-d]pyrimidine-based antiproliferative agents US Patent  US10829490 Publication Date 11/10/2020 
Target
Name:
Cyclin-dependent kinase 5 activator 1 [99-307]
Synonyms:
CDK5/p25 | Cyclin-Dependent Kinase 5 (CDK5)
Type:
Protein Complex
Mol. Mass.:
Description:
Components:
This complex has 2 components.
Component 1
Name:
Cyclin-dependent kinase 5
Synonyms:
CDK5 CDKN5 Cyclin-dependent kinase 5 (CDK5/ p25) Cyclin-dependent-like kinase 5 PSSALRE Tau protein kinase II catalytic subunit
Type:
Enzyme Subunit
Mol. Mass.:
33308.61
Organism:
Homo sapiens (Human)
Description:
Residue:
292
  
Component 2
Name:
Cyclin-dependent kinase 5 activator 1 [99-307]
Synonyms:
CD5R1_HUMAN CDK5R1 Cyclin-dependent kinase 5 activator 1, p25 TPKII regulatory subunit | p25
Type:
Enzyme Subunit
Mol. Mass.:
23250.56
Organism:
Homo sapiens (Human)
Description:
Q15078 aa 99-307
Residue:
209
  
Inhibitor
Name:
BDBM472683
Synonyms:
N-(5-(4-methylpiperazin-1- yl)pyridin-2-yl)-8',9'- dihydrospiro[cyclohexane-1,10'- pyrido[1,6-a:2,3-d']dipyrimidin]- 2'-amine | US10829490, Cmpd # 9
Type:
Small organic molecule
Emp. Form.:
C25H32N8
Mol. Mass.:
444.5752
SMILES:
CN1CCN(CC1)c1ccc(Nc2ncc3C=CC4=NCCC5(CCCCC5)N4c3n2)nc1
: