Target
Tyrosine-protein kinase JAK2
Ligand
BDBM472735
Substrate
Meas. Tech.
Homogeneous Time-Resolved Fluorescence (HTRF) Assay
IC50
>20.0±n/a nM
Citation
 Zhu, LHu, YWu, WDai, LDuan, XYang, YSun, YHan, YPeng, YKong, FLuo, HYang, LXu, HGuo, MZhong, ZWang, S Amino pyrazolopyrimidine compound used as neurotrophic factor tyrosine kinase receptor inhibitor US Patent  US10829492 Publication Date 11/10/2020 
Target
Name:
Tyrosine-protein kinase JAK2
Synonyms:
JAK-2 JAK2_HUMAN Janus kinase 2 (JAK2) | Janus kinase 2 (a protein tyrosine kinase)
Type:
Protein
Mol. Mass.:
130684.68
Organism:
Homo sapiens (Human)
Description:
O60674
Residue:
1132
  
Inhibitor
Name:
BDBM472735
Synonyms:
2-amino-5-((R)-2-(2,5-difluorophenyl)pyrrolidin-1-yl)-N-((trans)-4-hydroxycyclohexyl)pyrazolo[1,5-a]pyrimidine-3-carboxamide | US10829492, Example 12
Type:
Small organic molecule
Emp. Form.:
C23H26F2N6O2
Mol. Mass.:
456.4883
SMILES:
Nc1nn2ccc(nc2c1C(=O)N[C@H]1CC[C@H](O)CC1)N1CCC[C@@H]1c1cc(F)ccc1F
: