Target
NT-3 growth factor receptor
Ligand
BDBM472737
Substrate
Meas. Tech.
Inhibitory Activity Assay
IC50
<10.00±n/a nM
Citation
 Zhu, LHu, YWu, WDai, LDuan, XYang, YSun, YHan, YPeng, YKong, FLuo, HYang, LXu, HGuo, MZhong, ZWang, S Amino pyrazolopyrimidine compound used as neurotrophic factor tyrosine kinase receptor inhibitor US Patent  US10829492 Publication Date 11/10/2020 
Target
Name:
NT-3 growth factor receptor
Synonyms:
GP145-TrkC NTRK3_HUMAN Neurotrophic tyrosine kinase receptor type 3 Trk-C Tyrosine kinase receptor C (Trk-C)
Type:
Enzyme
Mol. Mass.:
94428.15
Organism:
Homo sapiens (Human)
Description:
Q16288
Residue:
839
  
Inhibitor
Name:
BDBM472737
Synonyms:
(R)-2-amino-5-(2-(2,5-difluorophenyl)pyrrolidin-1-yl)-N-(4-fluorophenyl)pyrazolo[1,5-a]pyrimidine-3-carboxamide | US10829492, Example 14
Type:
Small organic molecule
Emp. Form.:
C23H19F3N6O
Mol. Mass.:
452.4318
SMILES:
Nc1nn2ccc(nc2c1C(=O)Nc1ccc(F)cc1)N1CCC[C@@H]1c1cc(F)ccc1F
: