Target
Mast/stem cell growth factor receptor Kit [D816V]
Ligand
BDBM472777
Substrate
Meas. Tech.
Biochemical Enzymatic Activity
IC50
<0.30±n/a nM
Citation
 Dineen, TA Compositions and methods for treating KIT- and PDGFRA-mediated diseases US Patent  US10829493 Publication Date 11/10/2020 
Target
Name:
Mast/stem cell growth factor receptor Kit [D816V]
Synonyms:
KIT Mast/stem cell growth factor receptor Kit (D816V) SCFR | Tyrosine-protein kinase Kit (Kit)(D816V)
Type:
Protein
Mol. Mass.:
109854.42
Organism:
Homo sapiens (Human)
Description:
Human Kit D816V mutant
Residue:
976
  
Inhibitor
Name:
BDBM472777
Synonyms:
US10829493, Example 3
Type:
Small organic molecule
Emp. Form.:
C12H14N6O
Mol. Mass.:
258.2792
SMILES:
C[C@@H](O)Cn1cc(cn1)-c1cc2c(N)ncnn2c1
: