Target
Mast/stem cell growth factor receptor Kit [D816V]
Ligand
BDBM472795
Substrate
Meas. Tech.
Biochemical Enzymatic Activity
IC50
0.65±n/a nM
Citation
 Dineen, TA Compositions and methods for treating KIT- and PDGFRA-mediated diseases US Patent  US10829493 Publication Date 11/10/2020 
Target
Name:
Mast/stem cell growth factor receptor Kit [D816V]
Synonyms:
KIT Mast/stem cell growth factor receptor Kit (D816V) SCFR | Tyrosine-protein kinase Kit (Kit)(D816V)
Type:
Protein
Mol. Mass.:
109854.42
Organism:
Homo sapiens (Human)
Description:
Human Kit D816V mutant
Residue:
976
  
Inhibitor
Name:
BDBM472795
Synonyms:
US10829493, Example 21
Type:
Small organic molecule
Emp. Form.:
C29H31FN10O
Mol. Mass.:
554.6212
SMILES:
C[C@](N)(c1ccc(F)cc1)c1cnc(nc1)N1CCN(CC1)c1ncnn2cc(cc12)-c1cnn(c1)[C@H]1CC[C@@H]1O
: