Target
Interleukin-1 receptor-associated kinase 4
Ligand
BDBM472820
Substrate
Meas. Tech.
Inhibition Assay
IC50
20.2±n/a nM
Citation
 Ahmad, SLi, LNegash, LAHynes, J Thienopyridines and benzothiophenes useful as IRAK4 inhibitors US Patent  US10829496 Publication Date 11/10/2020 
Target
Name:
Interleukin-1 receptor-associated kinase 4
Synonyms:
IRAK-4 IRAK4_HUMAN Interleukin-1 receptor-associated kinase 4 (IRAK4) | Renal carcinoma antigen NY-REN-64
Type:
Protein
Mol. Mass.:
51519.08
Organism:
Homo sapiens (Human)
Description:
Q9NWZ3
Residue:
460
  
Inhibitor
Name:
BDBM472820
Synonyms:
US10829496, Example 24
Type:
Small organic molecule
Emp. Form.:
C18H20FN3O4S
Mol. Mass.:
393.433
SMILES:
CC[C@H]1[C@@H](COc2csc3cc(C(N)=O)c(OC4CC4)nc23)NC(=O)[C@H]1F
: