Target
Interleukin-1 receptor-associated kinase 4
Ligand
BDBM472825
Substrate
Meas. Tech.
Inhibition Assay
IC50
0.900±n/a nM
Citation
 Ahmad, SLi, LNegash, LAHynes, J Thienopyridines and benzothiophenes useful as IRAK4 inhibitors US Patent  US10829496 Publication Date 11/10/2020 
Target
Name:
Interleukin-1 receptor-associated kinase 4
Synonyms:
IRAK-4 IRAK4_HUMAN Interleukin-1 receptor-associated kinase 4 (IRAK4) | Renal carcinoma antigen NY-REN-64
Type:
Protein
Mol. Mass.:
51519.08
Organism:
Homo sapiens (Human)
Description:
Q9NWZ3
Residue:
460
  
Inhibitor
Name:
BDBM472825
Synonyms:
US10829496, Example 29
Type:
Small organic molecule
Emp. Form.:
C17H20N2O4S
Mol. Mass.:
348.417
SMILES:
CC[C@@H]1CC(=O)N[C@@H]1COc1csc2cc(C(N)=O)c(OC)cc12
: