Target
Beta-secretase 1
Ligand
BDBM472826
Substrate
Meas. Tech.
Pharmacological Test
IC50
86.0±n/a nM
Citation
 Bartels, BDolente, CGuba, WHaap, WKuglstatter, AObst Sander, UPeters, JRogers-Evans, MWoltering, TSchnider, CWermuth, R Pyridyl-triazabicycles US Patent  US10829500 Publication Date 11/10/2020 
Target
Name:
Beta-secretase 1
Synonyms:
ASP2 Aspartyl protease 2 BACE1 Beta-secretase (BACE) Beta-secretase 1 (BACE 1) Beta-secretase 1 (BACE1) Beta-site amyloid precursor protein cleaving enzyme 1 Memapsin-2 beta-Secretase (BACE-1) | beta-Secretase (BACE1)
Type:
Protein
Mol. Mass.:
55755.10
Organism:
Homo sapiens (Human)
Description:
P56817
Residue:
501
  
Inhibitor
Name:
BDBM472826
Synonyms:
US10829500, Exam. 1
Type:
Small organic molecule
Emp. Form.:
C20H21FN8O2S
Mol. Mass.:
456.497
SMILES:
C[C@]1(C[S@]2(=O)=NCCCCN2C(N)=N1)c1nc(NC(=O)c2ccc(cn2)C#N)ccc1F
: