Target
Phosphatidylinositol 4,5-bisphosphate 3-kinase catalytic subunit delta isoform
Ligand
BDBM394313
Substrate
Meas. Tech.
Scintillation Proximity Assay
IC50
<50±n/a nM
Citation
 Li, YMetcalf, BWCombs, AP Pyrimidinones as PI3K inhibitors US Patent  US10829502 Publication Date 11/10/2020 
Target
Name:
Phosphatidylinositol 4,5-bisphosphate 3-kinase catalytic subunit delta isoform
Synonyms:
PI3-kinase p110 subunit delta PI3-kinase subunit p110-delta PIK3CD Phosphatidylinositol 4,5-biphosphate 3-kinase catalytic subunit delta (PIK3CD) Phosphatidylinositol 4,5-bisphosphate 3-kinase 110 kDa catalytic subunit delta (PI3K delta) Phosphatidylinositol 4,5-bisphosphate 3-kinase catalytic subunit delta (PI3Kdelta) Phosphatidylinositol 4,5-bisphosphate 3-kinase catalytic subunit delta isoform (PI3K delta) Phosphatidylinositol 4,5-bisphosphate 3-kinase catalytic subunit delta isoform (PI3K-delta) Phosphatidylinositol 4,5-bisphosphate 3-kinase catalytic subunit delta isoform (PI3Kdelta)
Type:
Enzyme Subunit
Mol. Mass.:
119489.41
Organism:
Homo sapiens (Human)
Description:
O00329
Residue:
1044
  
Inhibitor
Name:
BDBM394313
Synonyms:
US10428087, Example 33 US11401280, Example 33 | US9975907, Example 33
Type:
Small organic molecule
Emp. Form.:
C20H17FN8OS
Mol. Mass.:
436.465
SMILES:
CC(Nc1nc(N)nc2[nH]cnc12)c1nc2scc(C)n2c(=O)c1-c1ccccc1F
: