Target
Fibroblast growth factor receptor 2
Ligand
BDBM161402
Substrate
Meas. Tech.
Measurement of Inhibitory Effect on FGFR2 Kinase Activity
IC50
3.00±n/a nM
Citation
 Sootome, H Therapeutic agent for FGFR inhibitor-resistant cancer US Patent  US10835536 Publication Date 11/17/2020 
Target
Name:
Fibroblast growth factor receptor 2
Synonyms:
BEK FGFR-2 FGFR2 Fibroblast growth factor receptor 2 (FGFR2) KGFR Keratinocyte growth factor receptor VEGF-receptor 2 and Fibroblast growth factor receptor 2
Type:
Enzyme
Mol. Mass.:
92015.45
Organism:
Homo sapiens (Human)
Description:
P21802
Residue:
821
  
Inhibitor
Name:
BDBM161402
Synonyms:
US10124003, Ex. Compound 15 US10894048, Ex Comp 15 | US9108973, 15
Type:
Small organic molecule
Emp. Form.:
C25H29N7O3
Mol. Mass.:
475.5429
SMILES:
CCN(C)C\C=C\C(=O)N1CC(C1)n1nc(C#Cc2cc(OC)cc(OC)c2)c2c(N)ncnc12
: