Target
Fibroblast growth factor receptor 2
Ligand
BDBM161410
Substrate
Meas. Tech.
Measurement of Inhibitory Effect on FGFR2 Kinase Activity
IC50
6.80±n/a nM
Citation
 Sootome, H Therapeutic agent for FGFR inhibitor-resistant cancer US Patent  US10835536 Publication Date 11/17/2020 
Target
Name:
Fibroblast growth factor receptor 2
Synonyms:
BEK FGFR-2 FGFR2 Fibroblast growth factor receptor 2 (FGFR2) KGFR Keratinocyte growth factor receptor VEGF-receptor 2 and Fibroblast growth factor receptor 2
Type:
Enzyme
Mol. Mass.:
92015.45
Organism:
Homo sapiens (Human)
Description:
P21802
Residue:
821
  
Inhibitor
Name:
BDBM161410
Synonyms:
US10124003, Ex. Compound 23 US10894048, Ex Comp 23 | US9108973, 23
Type:
Small organic molecule
Emp. Form.:
C26H28FN7O3
Mol. Mass.:
505.544
SMILES:
COc1cc(OC)cc(c1)C#Cc1nn(C2CN(C2)C(=O)\C=C\CN2CC[C@@H](F)C2)c2ncnc(N)c12
: