Target
Mu-type opioid receptor
Ligand
BDBM472721
Substrate
Meas. Tech.
G-Protein Assay
EC50
34.0±n/a nM
Citation
 Tounge, BABayoumy, SKuo, LCDax, SL Substituted 3-dialkylaminomethyl-piperidin-4-yl-benzamides and methods of making and using same US Patent  US10836728 Publication Date 11/17/2020 
Target
Name:
Mu-type opioid receptor
Synonyms:
M-OR-1 MOR-1 MUOR1 Mu opiate receptor OPRM1 hMOP | mu-type opioid receptor isoform MOR-1
Type:
G Protein-Coupled Receptor (GPCR)
Mol. Mass.:
44789.51
Organism:
Homo sapiens (Human)
Description:
P35372
Residue:
400
  
Inhibitor
Name:
BDBM472721
Synonyms:
3-(3-((Dimethylamino)methyl)-4-hydroxy-1-phenethylpiperidin-4-yl)benzamide | US10836728, Compound (9)
Type:
Small organic molecule
Emp. Form.:
C23H31N3O2
Mol. Mass.:
381.5111
SMILES:
CN(C)CC1CN(CCc2ccccc2)CCC1(O)c1cccc(c1)C(N)=O
: