Target
Beta-arrestin-1
Ligand
BDBM472836
Substrate
Meas. Tech.
beta-Arrestin Assay
EC50
270±n/a nM
Citation
 Tounge, BABayoumy, SKuo, LCDax, SL Substituted 3-dialkylaminomethyl-piperidin-4-yl-benzamides and methods of making and using same US Patent  US10836728 Publication Date 11/17/2020 
Target
Name:
Beta-arrestin-1
Synonyms:
ARR1 ARRB1_HUMAN | Arrestin, beta 1
Type:
Enzyme Catalytic Domain
Mol. Mass.:
47062.57
Organism:
Homo sapiens (Human)
Description:
gi_13177715
Residue:
418
  
Inhibitor
Name:
BDBM472836
Synonyms:
3-[3-Dimethylaminomethyl-4-hydroxy-1-(3-phenyl-propyl)-piperidin-4-yl]-benzamide | US10836728, Compound (20)
Type:
Small organic molecule
Emp. Form.:
C24H31N3O
Mol. Mass.:
377.5224
SMILES:
CN(C)CC1CN(CCCc2ccccc2)CCC1(O)c1cccc(c1)C#N
: