Target
Ubiquitin carboxyl-terminal hydrolase 7 [208-1102]
Ligand
BDBM421830
Substrate
Meas. Tech.
USP7 Assay A (Ubitquin-Rhodamine 110 Assay)
IC50
5500±n/a nM
Citation
 Ioannidis, STalbot, ACFollows, BBuckmelter, AJWang, MCampbell, ALancia, Jr., DR Quinazolinones and azaquinazolinones as ubiquitin-specific protease 7 inhibitors US Patent  US10836741 Publication Date 11/17/2020 
Target
Name:
Ubiquitin carboxyl-terminal hydrolase 7 [208-1102]
Synonyms:
HAUSP USP7 | USP7 (aa 208-1102)
Type:
PROTEIN
Mol. Mass.:
104393.08
Organism:
Homo sapiens (Human)
Description:
Q93009[208-1102]
Residue:
895
  
Inhibitor
Name:
BDBM421830
Synonyms:
3-((1-benzoyl-4-hydroxypiperidin-4-yl)methyl)-8-phenylquinazolin-4(3H)-one US10513507, Example I-9 | US10836741, Example I-9
Type:
Small organic molecule
Emp. Form.:
C27H25N3O3
Mol. Mass.:
439.5057
SMILES:
OC1(Cn2cnc3c(cccc3c2=O)-c2ccccc2)CCN(CC1)C(=O)c1ccccc1
: