Target
Lysine-specific histone demethylase 1A
Ligand
BDBM472904
Substrate
Meas. Tech.
LSD1 In Vitro Activity Assay
IC50
21.5±1.88 nM
Citation
 Liu, HLi, JWang, JSu, MWang, SZhou, YZhu, WXu, WLi, CJiang, HChen, K Fluorinated cyclopropylamine compound, preparation method therefor, pharmaceutical composition thereof, and uses thereof US Patent  US10836743 Publication Date 11/17/2020 
Target
Name:
Lysine-specific histone demethylase 1A
Synonyms:
AOF2 Flavin-containing amine oxidase domain-containing protein 2 KDM1A KIAA0601 Lysine-specific demethylase 1 (LSD1) Lysine-specific histone demethylase 1 (LSD1)
Type:
Enzyme
Mol. Mass.:
92901.01
Organism:
Homo sapiens (Human)
Description:
O60341
Residue:
852
  
Inhibitor
Name:
BDBM472904
Synonyms:
N-((4-fluoro-1-(piperidin-4-yl- methyl)sulfonyl)piperidin-4-yl) methyl)-trans-2-phenylcyclo- propylamine | US10836743, Compound A92
Type:
Small organic molecule
Emp. Form.:
C21H32FN3O2S
Mol. Mass.:
409.561
SMILES:
FC1(CNC2CC2c2ccccc2)CCN(CC1)S(=O)(=O)CC1CCNCC1
: