Target
Amine oxidase [flavin-containing] B
Ligand
BDBM472858
Substrate
Meas. Tech.
MAOA and MAOB In Vitro Activity Experiments
IC50
>100000±n/a nM
Citation
 Liu, HLi, JWang, JSu, MWang, SZhou, YZhu, WXu, WLi, CJiang, HChen, K Fluorinated cyclopropylamine compound, preparation method therefor, pharmaceutical composition thereof, and uses thereof US Patent  US10836743 Publication Date 11/17/2020 
Target
Name:
Amine oxidase [flavin-containing] B
Synonyms:
AOFB_HUMAN MAOB Monoamine oxidase type B (MAO B) Monoamine oxidase type B (MAOB)
Type:
Protein
Mol. Mass.:
58768.76
Organism:
Homo sapiens (Human)
Description:
P27338
Residue:
520
  
Inhibitor
Name:
BDBM472858
Synonyms:
N-((4-fluoropiperidin-4-yl)methyl)- trans-2-phenylcyclopropylamine | US10836743, Compound A2
Type:
Small organic molecule
Emp. Form.:
C15H21FN2
Mol. Mass.:
248.339
SMILES:
FC1(CNC2CC2c2ccccc2)CCNCC1
: