Target
Amine oxidase [flavin-containing] A
Ligand
BDBM472882
Substrate
Meas. Tech.
MAOA and MAOB In Vitro Activity Experiments
IC50
>100000±n/a nM
Citation
 Liu, HLi, JWang, JSu, MWang, SZhou, YZhu, WXu, WLi, CJiang, HChen, K Fluorinated cyclopropylamine compound, preparation method therefor, pharmaceutical composition thereof, and uses thereof US Patent  US10836743 Publication Date 11/17/2020 
Target
Name:
Amine oxidase [flavin-containing] A
Synonyms:
AOFA_HUMAN MAO-A Monoamine oxidase Monoamine oxidase type A (MAO A) Monoamine oxidase type A (MAOA)
Type:
Protein
Mol. Mass.:
59689.53
Organism:
Homo sapiens (Human)
Description:
P21397
Residue:
527
  
Inhibitor
Name:
BDBM472882
Synonyms:
N-((1-(3-cyclohexylpropyl)-4-fluoro- piperidin-4-yl)methyl)-trans-2- phenylcyclopropylamine | US10836743, Compound A14
Type:
Small organic molecule
Emp. Form.:
C24H37FN2
Mol. Mass.:
372.5624
SMILES:
FC1(CNC2CC2c2ccccc2)CCN(CCCC2CCCCC2)CC1
: