Target
Amine oxidase [flavin-containing] B
Ligand
BDBM472890
Substrate
Meas. Tech.
MAOA and MAOB In Vitro Activity Experiments
IC50
177300±9050 nM
Citation
 Liu, HLi, JWang, JSu, MWang, SZhou, YZhu, WXu, WLi, CJiang, HChen, K Fluorinated cyclopropylamine compound, preparation method therefor, pharmaceutical composition thereof, and uses thereof US Patent  US10836743 Publication Date 11/17/2020 
Target
Name:
Amine oxidase [flavin-containing] B
Synonyms:
AOFB_HUMAN MAOB Monoamine oxidase type B (MAO B) Monoamine oxidase type B (MAOB)
Type:
Protein
Mol. Mass.:
58768.76
Organism:
Homo sapiens (Human)
Description:
P27338
Residue:
520
  
Inhibitor
Name:
BDBM472890
Synonyms:
N-((1-fluorocyclohexyl)methyl)- trans-2-phenylcyclopropylamine | US10836743, Compound A18
Type:
Small organic molecule
Emp. Form.:
C16H22FN
Mol. Mass.:
247.351
SMILES:
FC1(CNC2CC2c2ccccc2)CCCCC1
: