Target
Sodium channel protein type 9 subunit alpha
Ligand
BDBM50237499
Substrate
Meas. Tech.
Ligand Binding Assay (LBA)
IC50
16.0±n/a nM
Citation
 Wu, YGuernon, JM Acyl sulfonamide NaV1.7 inhibitors US Patent  US10836758 Publication Date 11/17/2020 
Target
Name:
Sodium channel protein type 9 subunit alpha
Synonyms:
NENA Peripheral sodium channel 1 SCN9A_HUMAN Voltage-gated sodium channel subunit Nav1.7 hNE-Na
Type:
Protein
Mol. Mass.:
226375.97
Organism:
Homo sapiens (Human)
Description:
Q15858
Residue:
1988
  
Inhibitor
Name:
BDBM50237499
Synonyms:
CHEMBL4076627 | US10836758, Example 19
Type:
Small organic molecule
Emp. Form.:
C15H19ClFN5O2S2
Mol. Mass.:
419.925
SMILES:
N[C@H]1CC[C@@H](CNc2cc(F)c(cc2Cl)S(=O)(=O)Nc2ncns2)CC1
: