Target
Sodium channel protein type 9 subunit alpha
Ligand
BDBM472947
Substrate
Meas. Tech.
Ligand Binding Assay (LBA)
IC50
210±n/a nM
Citation
 Wu, YGuernon, JM Acyl sulfonamide NaV1.7 inhibitors US Patent  US10836758 Publication Date 11/17/2020 
Target
Name:
Sodium channel protein type 9 subunit alpha
Synonyms:
NENA Peripheral sodium channel 1 SCN9A_HUMAN Voltage-gated sodium channel subunit Nav1.7 hNE-Na
Type:
Protein
Mol. Mass.:
226375.97
Organism:
Homo sapiens (Human)
Description:
Q15858
Residue:
1988
  
Inhibitor
Name:
BDBM472947
Synonyms:
US10836758, Example 36
Type:
Small organic molecule
Emp. Form.:
C15H16Cl2FN3O2S2
Mol. Mass.:
424.341
SMILES:
Fc1cc(N[C@@H]2CC[C@H](Cl)CC2)c(Cl)cc1S(=O)(=O)Nc1nccs1
: