Target
Sodium channel protein type 9 subunit alpha
Ligand
BDBM472925
Substrate
Meas. Tech.
Ligand Binding Assay (LBA)
IC50
138±n/a nM
Citation
 Wu, YGuernon, JM Acyl sulfonamide NaV1.7 inhibitors US Patent  US10836758 Publication Date 11/17/2020 
Target
Name:
Sodium channel protein type 9 subunit alpha
Synonyms:
NENA Peripheral sodium channel 1 SCN9A_HUMAN Voltage-gated sodium channel subunit Nav1.7 hNE-Na
Type:
Protein
Mol. Mass.:
226375.97
Organism:
Homo sapiens (Human)
Description:
Q15858
Residue:
1988
  
Inhibitor
Name:
BDBM472925
Synonyms:
US10836758, Example 14 | US10836758, Example 68
Type:
Small organic molecule
Emp. Form.:
C17H22ClFN4O3S2
Mol. Mass.:
448.963
SMILES:
COCCN1CCCC1CNc1cc(F)c(cc1Cl)S(=O)(=O)Nc1nccs1
: