Target
Tyrosine-protein kinase JAK1
Ligand
BDBM350089
Substrate
Meas. Tech.
Biochemical JAK Kinase Assays
Ki
0.050±n/a nM
Citation
 Long, DDSmith, CThompson, C 5 to 7 membered heterocyclic amides as JAK inhibitors US Patent  US10836763 Publication Date 11/17/2020 
Target
Name:
Tyrosine-protein kinase JAK1
Synonyms:
JAK-1 JAK1A JAK1_HUMAN Janus kinase 1 (JAK1) | Janus kinase 1 JAK1
Type:
Protein
Mol. Mass.:
133293.73
Organism:
Homo sapiens (Human)
Description:
P23458
Residue:
1154
  
Inhibitor
Name:
BDBM350089
Synonyms:
((S)-2-(6-(2-ethyl-5-fluoro-4-hydroxyphenyl)-1H-indazol-3-yl)-5-propyl-4,5,6,7-tetrahydro-3H-imidazo[4,5-c]pyridin-6-yl)((1S,4S)-5-methyl-2,5-diazabicyclo-[2.2.1]heptan-2-yl)methanone US10519153, Example 1 US11254669, Example 1 US11713315, Example C-2
Type:
Small organic molecule
Emp. Form.:
C31H36FN7O2
Mol. Mass.:
557.6616
SMILES:
CCCN1Cc2[nH]c(nc2C[C@H]1C(=O)N1C[C@@H]2C[C@H]1CN2C)-c1n[nH]c2cc(ccc12)-c1cc(F)c(O)cc1CC
: